{"text_format":"1","workbook":"xlsx","n_sheets":5,"sheets":["Source data","Processed data","Mapping","Metadata","User"],"not_rendered":{"charts":0,"images":0,"macros":1,"external_links":0,"defined_names":2,"comments":0,"pivot_tables":0},"unopened":[],"bounds":{"document_bytes":16777216,"sheet_cells":100000,"rows_first":2000,"rows_last":500,"rows_between":2000,"halvings":0,"cell_chars":16384,"cell_head_chars":4096},"cells_cut":0,"cells_raw":0,"read":"whole","date_system":"1900"}

{"sheet":"Source data","index":0,"n_rows":1,"n_cols":6,"rows_kept":1,"cut":false,"hidden":false,"merged":[]}
["Source_record_ID","NHS number","FieldName2","FieldName3","FieldName4","FieldName5"]

{"sheet":"Processed data","index":1,"n_rows":1,"n_cols":9,"rows_kept":1,"cut":false,"hidden":false,"merged":[]}
["Study_ID","redcap_repeat_instrument","redcap_repeat_instance","Field01","Field02","Field03","Field04","Field05","redcap_data_access_group"]

{"sheet":"Mapping","index":2,"n_rows":266,"n_cols":8,"rows_kept":266,"cut":false,"hidden":false,"merged":[]}
[{"$f":"\"Columns in \" & MID(CELL(\"filename\",'Source data'!A1),FIND(\"]\",CELL(\"filename\",'Source data'!A1))+1,255)","v":"Columns in Source data"},{"$f":"\"Columns in \" & MID(CELL(\"filename\",'Processed data'!E1),FIND(\"]\",CELL(\"filename\",'Processed data'!E1))+1,255)","v":"Columns in Processed data"},"IndexFrom","IndexTo",null,{"$f":"\"Identifier in \" & MID(CELL(\"filename\",'Source data'!A1),FIND(\"]\",CELL(\"filename\",'Source data'!A1))+1,255)","v":"Identifier in Source data"},{"$f":"\"Sequence field in \" & MID(CELL(\"filename\",'Source data'!A1),FIND(\"]\",CELL(\"filename\",'Source data'!A1))+1,255)","v":"Sequence field in Source data"},"Target instrument"]
["NHS number","Study_ID",{"$f":"IF(A2<>\"\",MATCH(A2,'Source data'!$1:$1,0))","v":2},{"$f":"IF(B2<>\"\",MATCH(B2,'Processed data'!$1:$1,0))","v":1},null,"NHS number","FieldName3","Routine_Data"]
["FieldName2","Field02",{"$f":"IF(A3<>\"\",MATCH(A3,'Source data'!$1:$1,0))","v":3},{"$f":"IF(B3<>\"\",MATCH(B3,'Processed data'!$1:$1,0))","v":5}]
["FieldName3","Field03",{"$f":"IF(A4<>\"\",MATCH(A4,'Source data'!$1:$1,0))","v":4},{"$f":"IF(B4<>\"\",MATCH(B4,'Processed data'!$1:$1,0))","v":6}]
["FieldName4","Field04",{"$f":"IF(A5<>\"\",MATCH(A5,'Source data'!$1:$1,0))","v":5},{"$f":"IF(B5<>\"\",MATCH(B5,'Processed data'!$1:$1,0))","v":7}]
["FieldName5","Field05",{"$f":"IF(A6<>\"\",MATCH(A6,'Source data'!$1:$1,0))","v":6},{"$f":"IF(B6<>\"\",MATCH(B6,'Processed data'!$1:$1,0))","v":8}]
[null,null,{"$f":"IF(A7<>\"\",MATCH(A7,'Source data'!$1:$1,0))","v":false},{"$f":"IF(B7<>\"\",MATCH(B7,'Processed data'!$1:$1,0))","v":false}]
[null,null,{"$f":"IF(A8<>\"\",MATCH(A8,'Source data'!$1:$1,0))","v":false},{"$f":"IF(B8<>\"\",MATCH(B8,'Processed data'!$1:$1,0))","v":false}]
[null,null,{"$f":"IF(A9<>\"\",MATCH(A9,'Source data'!$1:$1,0))","v":false},{"$f":"IF(B9<>\"\",MATCH(B9,'Processed data'!$1:$1,0))","v":false}]
[null,null,{"$f":"IF(A10<>\"\",MATCH(A10,'Source data'!$1:$1,0))","v":false},{"$f":"IF(B10<>\"\",MATCH(B10,'Processed data'!$1:$1,0))","v":false}]
[null,null,{"$f":"IF(A11<>\"\",MATCH(A11,'Source data'!$1:$1,0))","v":false},{"$f":"IF(B11<>\"\",MATCH(B11,'Processed data'!$1:$1,0))","v":false}]
[null,null,{"$f":"IF(A12<>\"\",MATCH(A12,'Source data'!$1:$1,0))","v":false},{"$f":"IF(B12<>\"\",MATCH(B12,'Processed data'!$1:$1,0))","v":false}]
[null,null,{"$f":"IF(A13<>\"\",MATCH(A13,'Source data'!$1:$1,0))","v":false},{"$f":"IF(B13<>\"\",MATCH(B13,'Processed data'!$1:$1,0))","v":false}]
[null,null,{"$f":"IF(A14<>\"\",MATCH(A14,'Source data'!$1:$1,0))","v":false},{"$f":"IF(B14<>\"\",MATCH(B14,'Processed data'!$1:$1,0))","v":false}]
[null,null,{"$f":"IF(A15<>\"\",MATCH(A15,'Source data'!$1:$1,0))","v":false},{"$f":"IF(B15<>\"\",MATCH(B15,'Processed data'!$1:$1,0))","v":false}]
[null,null,{"$f":"IF(A16<>\"\",MATCH(A16,'Source data'!$1:$1,0))","v":false},{"$f":"IF(B16<>\"\",MATCH(B16,'Processed data'!$1:$1,0))","v":false}]
[null,null,{"$f":"IF(A17<>\"\",MATCH(A17,'Source data'!$1:$1,0))","v":false},{"$f":"IF(B17<>\"\",MATCH(B17,'Processed data'!$1:$1,0))","v":false}]
[null,null,{"$f":"IF(A18<>\"\",MATCH(A18,'Source data'!$1:$1,0))","v":false},{"$f":"IF(B18<>\"\",MATCH(B18,'Processed data'!$1:$1,0))","v":false}]
[null,null,{"$f":"IF(A19<>\"\",MATCH(A19,'Source data'!$1:$1,0))","v":false},{"$f":"IF(B19<>\"\",MATCH(B19,'Processed data'!$1:$1,0))","v":false}]
[null,null,{"$f":"IF(A20<>\"\",MATCH(A20,'Source data'!$1:$1,0))","v":false},{"$f":"IF(B20<>\"\",MATCH(B20,'Processed data'!$1:$1,0))","v":false}]
[null,null,{"$f":"IF(A21<>\"\",MATCH(A21,'Source data'!$1:$1,0))","v":false},{"$f":"IF(B21<>\"\",MATCH(B21,'Processed data'!$1:$1,0))","v":false}]
[null,null,{"$f":"IF(A22<>\"\",MATCH(A22,'Source data'!$1:$1,0))","v":false},{"$f":"IF(B22<>\"\",MATCH(B22,'Processed data'!$1:$1,0))","v":false}]
[null,null,{"$f":"IF(A23<>\"\",MATCH(A23,'Source data'!$1:$1,0))","v":false},{"$f":"IF(B23<>\"\",MATCH(B23,'Processed data'!$1:$1,0))","v":false}]
[null,null,{"$f":"IF(A24<>\"\",MATCH(A24,'Source data'!$1:$1,0))","v":false},{"$f":"IF(B24<>\"\",MATCH(B24,'Processed data'!$1:$1,0))","v":false}]
[null,null,{"$f":"IF(A25<>\"\",MATCH(A25,'Source data'!$1:$1,0))","v":false},{"$f":"IF(B25<>\"\",MATCH(B25,'Processed data'!$1:$1,0))","v":false}]
[null,null,{"$f":"IF(A26<>\"\",MATCH(A26,'Source data'!$1:$1,0))","v":false},{"$f":"IF(B26<>\"\",MATCH(B26,'Processed data'!$1:$1,0))","v":false}]
[null,null,{"$f":"IF(A27<>\"\",MATCH(A27,'Source data'!$1:$1,0))","v":false},{"$f":"IF(B27<>\"\",MATCH(B27,'Processed data'!$1:$1,0))","v":false}]
[null,null,{"$f":"IF(A28<>\"\",MATCH(A28,'Source data'!$1:$1,0))","v":false},{"$f":"IF(B28<>\"\",MATCH(B28,'Processed data'!$1:$1,0))","v":false}]
[null,null,{"$f":"IF(A29<>\"\",MATCH(A29,'Source data'!$1:$1,0))","v":false},{"$f":"IF(B29<>\"\",MATCH(B29,'Processed data'!$1:$1,0))","v":false}]
[null,null,{"$f":"IF(A30<>\"\",MATCH(A30,'Source data'!$1:$1,0))","v":false},{"$f":"IF(B30<>\"\",MATCH(B30,'Processed data'!$1:$1,0))","v":false}]
[null,null,{"$f":"IF(A31<>\"\",MATCH(A31,'Source data'!$1:$1,0))","v":false},{"$f":"IF(B31<>\"\",MATCH(B31,'Processed data'!$1:$1,0))","v":false}]
[null,null,{"$f":"IF(A32<>\"\",MATCH(A32,'Source data'!$1:$1,0))","v":false},{"$f":"IF(B32<>\"\",MATCH(B32,'Processed data'!$1:$1,0))","v":false}]
[null,null,{"$f":"IF(A33<>\"\",MATCH(A33,'Source data'!$1:$1,0))","v":false},{"$f":"IF(B33<>\"\",MATCH(B33,'Processed data'!$1:$1,0))","v":false}]
[null,null,{"$f":"IF(A34<>\"\",MATCH(A34,'Source data'!$1:$1,0))","v":false},{"$f":"IF(B34<>\"\",MATCH(B34,'Processed data'!$1:$1,0))","v":false}]
[null,null,{"$f":"IF(A35<>\"\",MATCH(A35,'Source data'!$1:$1,0))","v":false},{"$f":"IF(B35<>\"\",MATCH(B35,'Processed data'!$1:$1,0))","v":false}]
[null,null,{"$f":"IF(A36<>\"\",MATCH(A36,'Source data'!$1:$1,0))","v":false},{"$f":"IF(B36<>\"\",MATCH(B36,'Processed data'!$1:$1,0))","v":false}]
[null,null,{"$f":"IF(A37<>\"\",MATCH(A37,'Source data'!$1:$1,0))","v":false},{"$f":"IF(B37<>\"\",MATCH(B37,'Processed data'!$1:$1,0))","v":false}]
[null,null,{"$f":"IF(A38<>\"\",MATCH(A38,'Source data'!$1:$1,0))","v":false},{"$f":"IF(B38<>\"\",MATCH(B38,'Processed data'!$1:$1,0))","v":false}]
[null,null,{"$f":"IF(A39<>\"\",MATCH(A39,'Source data'!$1:$1,0))","v":false},{"$f":"IF(B39<>\"\",MATCH(B39,'Processed data'!$1:$1,0))","v":false}]
[null,null,{"$f":"IF(A40<>\"\",MATCH(A40,'Source data'!$1:$1,0))","v":false},{"$f":"IF(B40<>\"\",MATCH(B40,'Processed data'!$1:$1,0))","v":false}]
[null,null,{"$f":"IF(A41<>\"\",MATCH(A41,'Source data'!$1:$1,0))","v":false},{"$f":"IF(B41<>\"\",MATCH(B41,'Processed data'!$1:$1,0))","v":false}]
[null,null,{"$f":"IF(A42<>\"\",MATCH(A42,'Source data'!$1:$1,0))","v":false},{"$f":"IF(B42<>\"\",MATCH(B42,'Processed data'!$1:$1,0))","v":false}]
[null,null,{"$f":"IF(A43<>\"\",MATCH(A43,'Source data'!$1:$1,0))","v":false},{"$f":"IF(B43<>\"\",MATCH(B43,'Processed data'!$1:$1,0))","v":false}]
[null,null,{"$f":"IF(A44<>\"\",MATCH(A44,'Source data'!$1:$1,0))","v":false},{"$f":"IF(B44<>\"\",MATCH(B44,'Processed data'!$1:$1,0))","v":false}]
[null,null,{"$f":"IF(A45<>\"\",MATCH(A45,'Source data'!$1:$1,0))","v":false},{"$f":"IF(B45<>\"\",MATCH(B45,'Processed data'!$1:$1,0))","v":false}]
[null,null,{"$f":"IF(A46<>\"\",MATCH(A46,'Source data'!$1:$1,0))","v":false},{"$f":"IF(B46<>\"\",MATCH(B46,'Processed data'!$1:$1,0))","v":false}]
[null,null,{"$f":"IF(A47<>\"\",MATCH(A47,'Source data'!$1:$1,0))","v":false},{"$f":"IF(B47<>\"\",MATCH(B47,'Processed data'!$1:$1,0))","v":false}]
[null,null,{"$f":"IF(A48<>\"\",MATCH(A48,'Source data'!$1:$1,0))","v":false},{"$f":"IF(B48<>\"\",MATCH(B48,'Processed data'!$1:$1,0))","v":false}]
[null,null,{"$f":"IF(A49<>\"\",MATCH(A49,'Source data'!$1:$1,0))","v":false},{"$f":"IF(B49<>\"\",MATCH(B49,'Processed data'!$1:$1,0))","v":false}]
[null,null,{"$f":"IF(A50<>\"\",MATCH(A50,'Source data'!$1:$1,0))","v":false},{"$f":"IF(B50<>\"\",MATCH(B50,'Processed data'!$1:$1,0))","v":false}]
[null,null,{"$f":"IF(A51<>\"\",MATCH(A51,'Source data'!$1:$1,0))","v":false},{"$f":"IF(B51<>\"\",MATCH(B51,'Processed data'!$1:$1,0))","v":false}]
[null,null,{"$f":"IF(A52<>\"\",MATCH(A52,'Source data'!$1:$1,0))","v":false},{"$f":"IF(B52<>\"\",MATCH(B52,'Processed data'!$1:$1,0))","v":false}]
[null,null,{"$f":"IF(A53<>\"\",MATCH(A53,'Source data'!$1:$1,0))","v":false},{"$f":"IF(B53<>\"\",MATCH(B53,'Processed data'!$1:$1,0))","v":false}]
[null,null,{"$f":"IF(A54<>\"\",MATCH(A54,'Source data'!$1:$1,0))","v":false},{"$f":"IF(B54<>\"\",MATCH(B54,'Processed data'!$1:$1,0))","v":false}]
[null,null,{"$f":"IF(A55<>\"\",MATCH(A55,'Source data'!$1:$1,0))","v":false},{"$f":"IF(B55<>\"\",MATCH(B55,'Processed data'!$1:$1,0))","v":false}]
[null,null,{"$f":"IF(A56<>\"\",MATCH(A56,'Source data'!$1:$1,0))","v":false},{"$f":"IF(B56<>\"\",MATCH(B56,'Processed data'!$1:$1,0))","v":false}]
[null,null,{"$f":"IF(A57<>\"\",MATCH(A57,'Source data'!$1:$1,0))","v":false},{"$f":"IF(B57<>\"\",MATCH(B57,'Processed data'!$1:$1,0))","v":false}]
[null,null,{"$f":"IF(A58<>\"\",MATCH(A58,'Source data'!$1:$1,0))","v":false},{"$f":"IF(B58<>\"\",MATCH(B58,'Processed data'!$1:$1,0))","v":false}]
[null,null,{"$f":"IF(A59<>\"\",MATCH(A59,'Source data'!$1:$1,0))","v":false},{"$f":"IF(B59<>\"\",MATCH(B59,'Processed data'!$1:$1,0))","v":false}]
[null,null,{"$f":"IF(A60<>\"\",MATCH(A60,'Source data'!$1:$1,0))","v":false},{"$f":"IF(B60<>\"\",MATCH(B60,'Processed data'!$1:$1,0))","v":false}]
[null,null,{"$f":"IF(A61<>\"\",MATCH(A61,'Source data'!$1:$1,0))","v":false},{"$f":"IF(B61<>\"\",MATCH(B61,'Processed data'!$1:$1,0))","v":false}]
[null,null,{"$f":"IF(A62<>\"\",MATCH(A62,'Source data'!$1:$1,0))","v":false},{"$f":"IF(B62<>\"\",MATCH(B62,'Processed data'!$1:$1,0))","v":false}]
[null,null,{"$f":"IF(A63<>\"\",MATCH(A63,'Source data'!$1:$1,0))","v":false},{"$f":"IF(B63<>\"\",MATCH(B63,'Processed data'!$1:$1,0))","v":false}]
[null,null,{"$f":"IF(A64<>\"\",MATCH(A64,'Source data'!$1:$1,0))","v":false},{"$f":"IF(B64<>\"\",MATCH(B64,'Processed data'!$1:$1,0))","v":false}]
[null,null,{"$f":"IF(A65<>\"\",MATCH(A65,'Source data'!$1:$1,0))","v":false},{"$f":"IF(B65<>\"\",MATCH(B65,'Processed data'!$1:$1,0))","v":false}]
[null,null,{"$f":"IF(A66<>\"\",MATCH(A66,'Source data'!$1:$1,0))","v":false},{"$f":"IF(B66<>\"\",MATCH(B66,'Processed data'!$1:$1,0))","v":false}]
[null,null,{"$f":"IF(A67<>\"\",MATCH(A67,'Source data'!$1:$1,0))","v":false},{"$f":"IF(B67<>\"\",MATCH(B67,'Processed data'!$1:$1,0))","v":false}]
[null,null,{"$f":"IF(A68<>\"\",MATCH(A68,'Source data'!$1:$1,0))","v":false},{"$f":"IF(B68<>\"\",MATCH(B68,'Processed data'!$1:$1,0))","v":false}]
[null,null,{"$f":"IF(A69<>\"\",MATCH(A69,'Source data'!$1:$1,0))","v":false},{"$f":"IF(B69<>\"\",MATCH(B69,'Processed data'!$1:$1,0))","v":false}]
[null,null,{"$f":"IF(A70<>\"\",MATCH(A70,'Source data'!$1:$1,0))","v":false},{"$f":"IF(B70<>\"\",MATCH(B70,'Processed data'!$1:$1,0))","v":false}]
[null,null,{"$f":"IF(A71<>\"\",MATCH(A71,'Source data'!$1:$1,0))","v":false},{"$f":"IF(B71<>\"\",MATCH(B71,'Processed data'!$1:$1,0))","v":false}]
[null,null,{"$f":"IF(A72<>\"\",MATCH(A72,'Source data'!$1:$1,0))","v":false},{"$f":"IF(B72<>\"\",MATCH(B72,'Processed data'!$1:$1,0))","v":false}]
[null,null,{"$f":"IF(A73<>\"\",MATCH(A73,'Source data'!$1:$1,0))","v":false},{"$f":"IF(B73<>\"\",MATCH(B73,'Processed data'!$1:$1,0))","v":false}]
[null,null,{"$f":"IF(A74<>\"\",MATCH(A74,'Source data'!$1:$1,0))","v":false},{"$f":"IF(B74<>\"\",MATCH(B74,'Processed data'!$1:$1,0))","v":false}]
[null,null,{"$f":"IF(A75<>\"\",MATCH(A75,'Source data'!$1:$1,0))","v":false},{"$f":"IF(B75<>\"\",MATCH(B75,'Processed data'!$1:$1,0))","v":false}]
[null,null,{"$f":"IF(A76<>\"\",MATCH(A76,'Source data'!$1:$1,0))","v":false},{"$f":"IF(B76<>\"\",MATCH(B76,'Processed data'!$1:$1,0))","v":false}]
[null,null,{"$f":"IF(A77<>\"\",MATCH(A77,'Source data'!$1:$1,0))","v":false},{"$f":"IF(B77<>\"\",MATCH(B77,'Processed data'!$1:$1,0))","v":false}]
[null,null,{"$f":"IF(A78<>\"\",MATCH(A78,'Source data'!$1:$1,0))","v":false},{"$f":"IF(B78<>\"\",MATCH(B78,'Processed data'!$1:$1,0))","v":false}]
[null,null,{"$f":"IF(A79<>\"\",MATCH(A79,'Source data'!$1:$1,0))","v":false},{"$f":"IF(B79<>\"\",MATCH(B79,'Processed data'!$1:$1,0))","v":false}]
[null,null,{"$f":"IF(A80<>\"\",MATCH(A80,'Source data'!$1:$1,0))","v":false},{"$f":"IF(B80<>\"\",MATCH(B80,'Processed data'!$1:$1,0))","v":false}]
{"$rows_left_out":187}
{"sheet":"Metadata","index":3,"n_rows":2001,"n_cols":12,"rows_kept":2001,"cut":false,"hidden":false,"merged":[]}
["dag","ordinal",null,null,null,null,null,"Seed","redcap_data_access_group","__GROUPID__","Max","Next"]
[{"$f":"LOWER(LEFT(User!B2,LEN(I2)))","v":""},{"$f":"ABS(RIGHT(User!B2,(LEN(User!B2)-LEN(I2))))","v":{"$error":"#VALUE!"}},null,null,null,null,null,500,"Site_01",null,{"$f":"_xlfn.MAXIFS(B:B,A:A,I2)","v":0},{"$f":"IF(K2<=H2,H2+1,K2+1)","v":501}]
[{"$f":"LOWER(LEFT(User!B3,LEN(I3)))","v":""},{"$f":"ABS(RIGHT(User!B3,(LEN(User!B3)-LEN(I3))))","v":{"$error":"#VALUE!"}}]
[{"$f":"LOWER(LEFT(User!B4,LEN(I4)))","v":""},{"$f":"ABS(RIGHT(User!B4,(LEN(User!B4)-LEN(I4))))","v":{"$error":"#VALUE!"}}]
[{"$f":"LOWER(LEFT(User!B5,LEN(I5)))","v":""},{"$f":"ABS(RIGHT(User!B5,(LEN(User!B5)-LEN(I5))))","v":{"$error":"#VALUE!"}}]
[{"$f":"LOWER(LEFT(User!B6,LEN(I6)))","v":""},{"$f":"ABS(RIGHT(User!B6,(LEN(User!B6)-LEN(I6))))","v":{"$error":"#VALUE!"}}]
[{"$f":"LOWER(LEFT(User!B7,LEN(I7)))","v":""},{"$f":"ABS(RIGHT(User!B7,(LEN(User!B7)-LEN(I7))))","v":{"$error":"#VALUE!"}}]
[{"$f":"LOWER(LEFT(User!B8,LEN(I8)))","v":""},{"$f":"ABS(RIGHT(User!B8,(LEN(User!B8)-LEN(I8))))","v":{"$error":"#VALUE!"}}]
[{"$f":"LOWER(LEFT(User!B9,LEN(I9)))","v":""},{"$f":"ABS(RIGHT(User!B9,(LEN(User!B9)-LEN(I9))))","v":{"$error":"#VALUE!"}}]
[{"$f":"LOWER(LEFT(User!B10,LEN(I10)))","v":""},{"$f":"ABS(RIGHT(User!B10,(LEN(User!B10)-LEN(I10))))","v":{"$error":"#VALUE!"}}]
[{"$f":"LOWER(LEFT(User!B11,LEN(I11)))","v":""},{"$f":"ABS(RIGHT(User!B11,(LEN(User!B11)-LEN(I11))))","v":{"$error":"#VALUE!"}}]
[{"$f":"LOWER(LEFT(User!B12,LEN(I12)))","v":""},{"$f":"ABS(RIGHT(User!B12,(LEN(User!B12)-LEN(I12))))","v":{"$error":"#VALUE!"}}]
[{"$f":"LOWER(LEFT(User!B13,LEN(I13)))","v":""},{"$f":"ABS(RIGHT(User!B13,(LEN(User!B13)-LEN(I13))))","v":{"$error":"#VALUE!"}}]
[{"$f":"LOWER(LEFT(User!B14,LEN(I14)))","v":""},{"$f":"ABS(RIGHT(User!B14,(LEN(User!B14)-LEN(I14))))","v":{"$error":"#VALUE!"}}]
[{"$f":"LOWER(LEFT(User!B15,LEN(I15)))","v":""},{"$f":"ABS(RIGHT(User!B15,(LEN(User!B15)-LEN(I15))))","v":{"$error":"#VALUE!"}}]
[{"$f":"LOWER(LEFT(User!B16,LEN(I16)))","v":""},{"$f":"ABS(RIGHT(User!B16,(LEN(User!B16)-LEN(I16))))","v":{"$error":"#VALUE!"}}]
[{"$f":"LOWER(LEFT(User!B17,LEN(I17)))","v":""},{"$f":"ABS(RIGHT(User!B17,(LEN(User!B17)-LEN(I17))))","v":{"$error":"#VALUE!"}}]
[{"$f":"LOWER(LEFT(User!B18,LEN(I18)))","v":""},{"$f":"ABS(RIGHT(User!B18,(LEN(User!B18)-LEN(I18))))","v":{"$error":"#VALUE!"}}]
[{"$f":"LOWER(LEFT(User!B19,LEN(I19)))","v":""},{"$f":"ABS(RIGHT(User!B19,(LEN(User!B19)-LEN(I19))))","v":{"$error":"#VALUE!"}}]
[{"$f":"LOWER(LEFT(User!B20,LEN(I20)))","v":""},{"$f":"ABS(RIGHT(User!B20,(LEN(User!B20)-LEN(I20))))","v":{"$error":"#VALUE!"}}]
[{"$f":"LOWER(LEFT(User!B21,LEN(I21)))","v":""},{"$f":"ABS(RIGHT(User!B21,(LEN(User!B21)-LEN(I21))))","v":{"$error":"#VALUE!"}}]
[{"$f":"LOWER(LEFT(User!B22,LEN(I22)))","v":""},{"$f":"ABS(RIGHT(User!B22,(LEN(User!B22)-LEN(I22))))","v":{"$error":"#VALUE!"}}]
[{"$f":"LOWER(LEFT(User!B23,LEN(I23)))","v":""},{"$f":"ABS(RIGHT(User!B23,(LEN(User!B23)-LEN(I23))))","v":{"$error":"#VALUE!"}}]
[{"$f":"LOWER(LEFT(User!B24,LEN(I24)))","v":""},{"$f":"ABS(RIGHT(User!B24,(LEN(User!B24)-LEN(I24))))","v":{"$error":"#VALUE!"}}]
[{"$f":"LOWER(LEFT(User!B25,LEN(I25)))","v":""},{"$f":"ABS(RIGHT(User!B25,(LEN(User!B25)-LEN(I25))))","v":{"$error":"#VALUE!"}}]
[{"$f":"LOWER(LEFT(User!B26,LEN(I26)))","v":""},{"$f":"ABS(RIGHT(User!B26,(LEN(User!B26)-LEN(I26))))","v":{"$error":"#VALUE!"}}]
[{"$f":"LOWER(LEFT(User!B27,LEN(I27)))","v":""},{"$f":"ABS(RIGHT(User!B27,(LEN(User!B27)-LEN(I27))))","v":{"$error":"#VALUE!"}}]
[{"$f":"LOWER(LEFT(User!B28,LEN(I28)))","v":""},{"$f":"ABS(RIGHT(User!B28,(LEN(User!B28)-LEN(I28))))","v":{"$error":"#VALUE!"}}]
[{"$f":"LOWER(LEFT(User!B29,LEN(I29)))","v":""},{"$f":"ABS(RIGHT(User!B29,(LEN(User!B29)-LEN(I29))))","v":{"$error":"#VALUE!"}}]
[{"$f":"LOWER(LEFT(User!B30,LEN(I30)))","v":""},{"$f":"ABS(RIGHT(User!B30,(LEN(User!B30)-LEN(I30))))","v":{"$error":"#VALUE!"}}]
[{"$f":"LOWER(LEFT(User!B31,LEN(I31)))","v":""},{"$f":"ABS(RIGHT(User!B31,(LEN(User!B31)-LEN(I31))))","v":{"$error":"#VALUE!"}}]
[{"$f":"LOWER(LEFT(User!B32,LEN(I32)))","v":""},{"$f":"ABS(RIGHT(User!B32,(LEN(User!B32)-LEN(I32))))","v":{"$error":"#VALUE!"}}]
[{"$f":"LOWER(LEFT(User!B33,LEN(I33)))","v":""},{"$f":"ABS(RIGHT(User!B33,(LEN(User!B33)-LEN(I33))))","v":{"$error":"#VALUE!"}}]
[{"$f":"LOWER(LEFT(User!B34,LEN(I34)))","v":""},{"$f":"ABS(RIGHT(User!B34,(LEN(User!B34)-LEN(I34))))","v":{"$error":"#VALUE!"}}]
[{"$f":"LOWER(LEFT(User!B35,LEN(I35)))","v":""},{"$f":"ABS(RIGHT(User!B35,(LEN(User!B35)-LEN(I35))))","v":{"$error":"#VALUE!"}}]
[{"$f":"LOWER(LEFT(User!B36,LEN(I36)))","v":""},{"$f":"ABS(RIGHT(User!B36,(LEN(User!B36)-LEN(I36))))","v":{"$error":"#VALUE!"}}]
[{"$f":"LOWER(LEFT(User!B37,LEN(I37)))","v":""},{"$f":"ABS(RIGHT(User!B37,(LEN(User!B37)-LEN(I37))))","v":{"$error":"#VALUE!"}}]
[{"$f":"LOWER(LEFT(User!B38,LEN(I38)))","v":""},{"$f":"ABS(RIGHT(User!B38,(LEN(User!B38)-LEN(I38))))","v":{"$error":"#VALUE!"}}]
[{"$f":"LOWER(LEFT(User!B39,LEN(I39)))","v":""},{"$f":"ABS(RIGHT(User!B39,(LEN(User!B39)-LEN(I39))))","v":{"$error":"#VALUE!"}}]
[{"$f":"LOWER(LEFT(User!B40,LEN(I40)))","v":""},{"$f":"ABS(RIGHT(User!B40,(LEN(User!B40)-LEN(I40))))","v":{"$error":"#VALUE!"}}]
[{"$f":"LOWER(LEFT(User!B41,LEN(I41)))","v":""},{"$f":"ABS(RIGHT(User!B41,(LEN(User!B41)-LEN(I41))))","v":{"$error":"#VALUE!"}}]
[{"$f":"LOWER(LEFT(User!B42,LEN(I42)))","v":""},{"$f":"ABS(RIGHT(User!B42,(LEN(User!B42)-LEN(I42))))","v":{"$error":"#VALUE!"}}]
[{"$f":"LOWER(LEFT(User!B43,LEN(I43)))","v":""},{"$f":"ABS(RIGHT(User!B43,(LEN(User!B43)-LEN(I43))))","v":{"$error":"#VALUE!"}}]
[{"$f":"LOWER(LEFT(User!B44,LEN(I44)))","v":""},{"$f":"ABS(RIGHT(User!B44,(LEN(User!B44)-LEN(I44))))","v":{"$error":"#VALUE!"}}]
[{"$f":"LOWER(LEFT(User!B45,LEN(I45)))","v":""},{"$f":"ABS(RIGHT(User!B45,(LEN(User!B45)-LEN(I45))))","v":{"$error":"#VALUE!"}}]
[{"$f":"LOWER(LEFT(User!B46,LEN(I46)))","v":""},{"$f":"ABS(RIGHT(User!B46,(LEN(User!B46)-LEN(I46))))","v":{"$error":"#VALUE!"}}]
[{"$f":"LOWER(LEFT(User!B47,LEN(I47)))","v":""},{"$f":"ABS(RIGHT(User!B47,(LEN(User!B47)-LEN(I47))))","v":{"$error":"#VALUE!"}}]
[{"$f":"LOWER(LEFT(User!B48,LEN(I48)))","v":""},{"$f":"ABS(RIGHT(User!B48,(LEN(User!B48)-LEN(I48))))","v":{"$error":"#VALUE!"}}]
[{"$f":"LOWER(LEFT(User!B49,LEN(I49)))","v":""},{"$f":"ABS(RIGHT(User!B49,(LEN(User!B49)-LEN(I49))))","v":{"$error":"#VALUE!"}}]
[{"$f":"LOWER(LEFT(User!B50,LEN(I50)))","v":""},{"$f":"ABS(RIGHT(User!B50,(LEN(User!B50)-LEN(I50))))","v":{"$error":"#VALUE!"}}]
[{"$f":"LOWER(LEFT(User!B51,LEN(I51)))","v":""},{"$f":"ABS(RIGHT(User!B51,(LEN(User!B51)-LEN(I51))))","v":{"$error":"#VALUE!"}}]
[{"$f":"LOWER(LEFT(User!B52,LEN(I52)))","v":""},{"$f":"ABS(RIGHT(User!B52,(LEN(User!B52)-LEN(I52))))","v":{"$error":"#VALUE!"}}]
[{"$f":"LOWER(LEFT(User!B53,LEN(I53)))","v":""},{"$f":"ABS(RIGHT(User!B53,(LEN(User!B53)-LEN(I53))))","v":{"$error":"#VALUE!"}}]
[{"$f":"LOWER(LEFT(User!B54,LEN(I54)))","v":""},{"$f":"ABS(RIGHT(User!B54,(LEN(User!B54)-LEN(I54))))","v":{"$error":"#VALUE!"}}]
[{"$f":"LOWER(LEFT(User!B55,LEN(I55)))","v":""},{"$f":"ABS(RIGHT(User!B55,(LEN(User!B55)-LEN(I55))))","v":{"$error":"#VALUE!"}}]
[{"$f":"LOWER(LEFT(User!B56,LEN(I56)))","v":""},{"$f":"ABS(RIGHT(User!B56,(LEN(User!B56)-LEN(I56))))","v":{"$error":"#VALUE!"}}]
[{"$f":"LOWER(LEFT(User!B57,LEN(I57)))","v":""},{"$f":"ABS(RIGHT(User!B57,(LEN(User!B57)-LEN(I57))))","v":{"$error":"#VALUE!"}}]
[{"$f":"LOWER(LEFT(User!B58,LEN(I58)))","v":""},{"$f":"ABS(RIGHT(User!B58,(LEN(User!B58)-LEN(I58))))","v":{"$error":"#VALUE!"}}]
[{"$f":"LOWER(LEFT(User!B59,LEN(I59)))","v":""},{"$f":"ABS(RIGHT(User!B59,(LEN(User!B59)-LEN(I59))))","v":{"$error":"#VALUE!"}}]
[{"$f":"LOWER(LEFT(User!B60,LEN(I60)))","v":""},{"$f":"ABS(RIGHT(User!B60,(LEN(User!B60)-LEN(I60))))","v":{"$error":"#VALUE!"}}]
[{"$f":"LOWER(LEFT(User!B61,LEN(I61)))","v":""},{"$f":"ABS(RIGHT(User!B61,(LEN(User!B61)-LEN(I61))))","v":{"$error":"#VALUE!"}}]
[{"$f":"LOWER(LEFT(User!B62,LEN(I62)))","v":""},{"$f":"ABS(RIGHT(User!B62,(LEN(User!B62)-LEN(I62))))","v":{"$error":"#VALUE!"}}]
[{"$f":"LOWER(LEFT(User!B63,LEN(I63)))","v":""},{"$f":"ABS(RIGHT(User!B63,(LEN(User!B63)-LEN(I63))))","v":{"$error":"#VALUE!"}}]
[{"$f":"LOWER(LEFT(User!B64,LEN(I64)))","v":""},{"$f":"ABS(RIGHT(User!B64,(LEN(User!B64)-LEN(I64))))","v":{"$error":"#VALUE!"}}]
[{"$f":"LOWER(LEFT(User!B65,LEN(I65)))","v":""},{"$f":"ABS(RIGHT(User!B65,(LEN(User!B65)-LEN(I65))))","v":{"$error":"#VALUE!"}}]
[{"$f":"LOWER(LEFT(User!B66,LEN(I66)))","v":""},{"$f":"ABS(RIGHT(User!B66,(LEN(User!B66)-LEN(I66))))","v":{"$error":"#VALUE!"}}]
[{"$f":"LOWER(LEFT(User!B67,LEN(I67)))","v":""},{"$f":"ABS(RIGHT(User!B67,(LEN(User!B67)-LEN(I67))))","v":{"$error":"#VALUE!"}}]
[{"$f":"LOWER(LEFT(User!B68,LEN(I68)))","v":""},{"$f":"ABS(RIGHT(User!B68,(LEN(User!B68)-LEN(I68))))","v":{"$error":"#VALUE!"}}]
[{"$f":"LOWER(LEFT(User!B69,LEN(I69)))","v":""},{"$f":"ABS(RIGHT(User!B69,(LEN(User!B69)-LEN(I69))))","v":{"$error":"#VALUE!"}}]
[{"$f":"LOWER(LEFT(User!B70,LEN(I70)))","v":""},{"$f":"ABS(RIGHT(User!B70,(LEN(User!B70)-LEN(I70))))","v":{"$error":"#VALUE!"}}]
[{"$f":"LOWER(LEFT(User!B71,LEN(I71)))","v":""},{"$f":"ABS(RIGHT(User!B71,(LEN(User!B71)-LEN(I71))))","v":{"$error":"#VALUE!"}}]
[{"$f":"LOWER(LEFT(User!B72,LEN(I72)))","v":""},{"$f":"ABS(RIGHT(User!B72,(LEN(User!B72)-LEN(I72))))","v":{"$error":"#VALUE!"}}]
[{"$f":"LOWER(LEFT(User!B73,LEN(I73)))","v":""},{"$f":"ABS(RIGHT(User!B73,(LEN(User!B73)-LEN(I73))))","v":{"$error":"#VALUE!"}}]
[{"$f":"LOWER(LEFT(User!B74,LEN(I74)))","v":""},{"$f":"ABS(RIGHT(User!B74,(LEN(User!B74)-LEN(I74))))","v":{"$error":"#VALUE!"}}]
[{"$f":"LOWER(LEFT(User!B75,LEN(I75)))","v":""},{"$f":"ABS(RIGHT(User!B75,(LEN(User!B75)-LEN(I75))))","v":{"$error":"#VALUE!"}}]
[{"$f":"LOWER(LEFT(User!B76,LEN(I76)))","v":""},{"$f":"ABS(RIGHT(User!B76,(LEN(User!B76)-LEN(I76))))","v":{"$error":"#VALUE!"}}]
[{"$f":"LOWER(LEFT(User!B77,LEN(I77)))","v":""},{"$f":"ABS(RIGHT(User!B77,(LEN(User!B77)-LEN(I77))))","v":{"$error":"#VALUE!"}}]
[{"$f":"LOWER(LEFT(User!B78,LEN(I78)))","v":""},{"$f":"ABS(RIGHT(User!B78,(LEN(User!B78)-LEN(I78))))","v":{"$error":"#VALUE!"}}]
[{"$f":"LOWER(LEFT(User!B79,LEN(I79)))","v":""},{"$f":"ABS(RIGHT(User!B79,(LEN(User!B79)-LEN(I79))))","v":{"$error":"#VALUE!"}}]
[{"$f":"LOWER(LEFT(User!B80,LEN(I80)))","v":""},{"$f":"ABS(RIGHT(User!B80,(LEN(User!B80)-LEN(I80))))","v":{"$error":"#VALUE!"}}]
{"$rows_left_out":1922}
{"sheet":"User","index":4,"n_rows":1,"n_cols":7,"rows_kept":1,"cut":false,"hidden":false,"merged":[]}
["Identifier","Study_ID",null,null,null,"Run","Reset"]